{"text_format":"1","workbook":"xlsx","n_sheets":9,"sheets":["Control de cambios","Tablas de referencia","Instructivo","Evaluación de Riesgos","Opc. Tratamiento Riesgo","Valoración de Activos","Análisis de Riesgos","Catálogo Amenazas","Catálogo Vulnerabilidades"],"not_rendered":{"charts":0,"images":4,"macros":1,"external_links":0,"defined_names":9,"comments":2,"pivot_tables":0},"unopened":[],"bounds":{"document_bytes":16777216,"sheet_cells":100000,"rows_first":2000,"rows_last":500,"rows_between":2000,"halvings":0,"cell_chars":16384,"cell_head_chars":4096},"cells_cut":0,"cells_raw":0,"read":"whole","date_system":"1900"}

{"sheet":"Control de cambios","index":0,"n_rows":17,"n_cols":3,"rows_kept":17,"cut":false,"hidden":false,"merged":[[1,0,1,2],[6,1,6,2],[7,1,7,2],[8,1,8,2],[2,0,2,2],[3,1,3,2],[4,1,4,2],[5,1,5,2]]}
[]
[]
["VERSIONAMIENTO"]
["Versión:","1.4"]
["Fecha de la versión:","2024-10-03"]
["Creado por:","Dirección de Infraestructura Interoperabilidad, Seguridad de la Información y Registro Civil"]
["Aprobado por:","Subsecretaría de Gobierno Electrónico y Registro Civil"]
["Nivel de confidencialidad:","Bajo"]
["Referencia:","ISO/IEC 27005; MAGERIT"]
[]
[]
["Versión","Fecha","Detalle de la modificación"]
["0.1","2019-02-01","Descripción básica del documento"]
["1.0","2019-09-13","Modificación del documento"]
["1.1","2020-02-27","Modificación del documento"]
["1.3","2024-02-28","Actualización del contenido"]
["1.4","2024-10-03","Actualización del contenido"]

{"sheet":"Tablas de referencia","index":1,"n_rows":46,"n_cols":6,"rows_kept":46,"cut":false,"hidden":false,"merged":[[44,2,44,3],[45,2,45,3],[1,1,1,2],[35,2,35,3],[19,1,19,2],[26,1,26,2]]}
[]
[null,"Tabla de valoración de Impacto en los activos de la información"]
[]
[null,"Valoración del impacto en términos de la perdida de la confidencialidad","Criterio"]
[null,"Alto (3)","La divulgación no autorizada de la información tiene un efecto critico para la institución Ej. Divulgación de información confidencial o sensible."]
[null,"Medio (2)","La divulgación no autorizada de la información tiene un efecto limitado para la institución  Ej. Divulgación de información de uso interno"]
[null,"Bajo (1)","La divulgación de la información no tiene ningún efecto para la institución  Ej. Divulgación de información pública."]
[]
[null,"Valoración del impacto en términos de la perdida de la integridad","Criterio"]
[null,"Alto (3)","La destrucción o modificación no autorizada de la información tiene un efecto severo para la institución"]
[null,"Medio (2)","La destrucción o modificación no autorizada de la información tiene un efecto considerable para la institución"]
[null,"Bajo (1)","La destrucción o modificación de la información tiene un efecto leve para la institución"]
[]
[null,"Valoración del impacto en términos de la perdida de disponibilidad","Criterio"]
[null,"Alto (3)","La interrupción al acceso de la información o los sistemas tienen un efecto severo para la institución"]
[null,"Medio (2)","La interrupción al acceso de la información o los sistemas tienen un efecto considerable para la institución"]
[null,"Bajo (1)","La interrupción al acceso de la información o los sistemas tienen un efecto mínimo para la institución"]
[]
[]
[null,"Estimación de amenazas"]
{"$rows_left_out":27}
{"sheet":"Instructivo","index":2,"n_rows":43,"n_cols":4,"rows_kept":43,"cut":false,"hidden":false,"merged":[[3,1,3,3],[1,1,1,3],[21,1,21,3]]}
[]
[null,"INSTRUCTIVO"]
[]
[null,"VALORACIÓN DEL ACTIVO"]
[]
[null,"No","CAMPO","INFORMACIÓN QUE DEBE CONTENER"]
[null,1,"Nro. Activo","Asignar el número consecutivo para cada de activo empezando desde A1"]
[null,2,"Proceso Macro","Registrar el nombre del proceso macro definido en el alcance del EGSI al cual pertenecen los activos de información"]
[null,3,"Subproceso","Registrar el nombre del subproceso que pertenecen los activos de información"]
[null,4,"Tipo de Activo","Un activo es un elemento importante con valor para la institución y debe protegerse; los activos incluyen toda información y soporte para el funcionamiento del proceso macro a ser evaluado; se clasifican en: Hardware, software, datos, redes, personal, localización y organización. (de no encontrar lo que necesita modifique el catalogo que se encuentra en la misma página)."]
[null,5,"Nombre del Activo ","Registrar el nombre del activo de información definido"]
[null,6,"Descripción del Activo","Digitar la descripción general del activo de información"]
[null,7,"Intensión del uso","Colocar el propósito de uso del activo de información"]
[null,8,"Tipos de soporte","Medios en los cuales se contiene la información  (de no encontrar lo que necesita modifique el catalogo que se encuentra en la misma página)."]
[null,9,"Propietario del Activo","Registrar el nombre del propietario del activo, que es una persona o una entidad a la que la gestión institucional le otorga responsabilidad de administrar el activo de información en su ciclo de vida completo."]
[null,10,"Ubicación","Especificar el lugar donde se encuentran los activos de información"]
[null,11,"Valoración del Impacto","Son las consecuencias o efectos que puede ocasionar la materialización del riesgo al proceso y por ende a la institución; valorando la confidencialidad, integridad y disponibilidad de la información"]
[null,12,"Confidencialidad","Propiedad que determina que la información no esté disponible; ni sea revelada a individuos, instituciones o procesos no autorizados"]
[null,13,"Integridad","Propiedad de salvaguardar la integridad de las aplicaciones e información preservando la información completa y exacta"]
[null,14,"Disponibilidad","Propiedad de que la información sea accesible, utilizable y/o disponible a los usuarios autorizados cuando estos lo requieran"]
{"$rows_left_out":24}
{"sheet":"Evaluación de Riesgos","index":3,"n_rows":12,"n_cols":16,"rows_kept":12,"cut":false,"hidden":false,"merged":[[1,13,1,15],[10,1,10,11],[11,1,11,11],[1,1,1,11],[3,1,3,2],[2,1,2,2],[2,3,2,5],[2,6,2,8],[2,9,2,11],[4,1,6,1],[8,1,8,11],[9,1,9,11]]}
[]
[null,"Tabla de evaluación del activo",null,null,null,null,null,null,null,null,null,null,null,"Nivel de Riesgo"]
[null,"Nivel de Amenaza",null,"Bajo (1)",null,null,"Medio (2)",null,null,"Alto (3)",null,null,null,1,3,"BAJO"]
[null,"Nivel de Vulnerabilidades",null," Bajo (1)","Medio (2)","Alto (3)"," Bajo (1)","Medio (2)","Alto (3)"," Bajo (1)","Medio (2)","Alto (3)",null,4,8,"MEDIO"]
[null,"Valor del impacto en términos de la pérdida de (CID) en los activos"," Bajo (1)",1,2,3,2,4,6,3,6,9,null,9,27,"ALTO"]
[null,null,"Medio (2)",2,4,6,4,8,12,6,12,18]
[null,null,"Alto (3)",3,6,9,6,12,18,9,18,27]
[]
[null,"Evaluación del Riesgo"]
[null,"Proceso de comparación del riesgo estimado contra un criterio de riesgo calculado dado para determinar la importancia del riesgo. El grado del riesgo es expresado numéricamente basado en las medidas del valor de los activos de información, el impacto de la amenaza y el alcance de la vulnerabilidad ."]
[null,"Formula para calcular el grado de riesgo"]
[null,"Riesgo actual = Valor del activo de la información (CID) x Amenaza x Vulnerabilidad"]

{"sheet":"Opc. Tratamiento Riesgo","index":4,"n_rows":6,"n_cols":8,"rows_kept":6,"cut":false,"hidden":false,"merged":[[1,2,1,3],[1,5,1,7]]}
[]
[null,null,"Opciones de Tratamiento",null,null,"Riesgo Residual"]
[null,null,"MITIGACIÓN, REDUCCIÓN O MODIFICACIÓN DEL RIESGO","Selección de uno o varios controles para reducir el riesgo a un nivel aceptable para la institución ej. Implementar políticas de control de acceso",null,1,3,"RETENER / ACEPTAR"]
[null,null,"PREVENCIÓN O EVITACIÓN DEL RIESGO","Eliminar la actividad de alto riesgo o cambiar las condiciones bajo las cuales la actividad es operada (remover el riesgo)",null,4,27,"MODIFICAR / PREVENIR / COMPARTIR "]
[null,null,"COMPARTICIÓN DEL RIESGO","Compartir con otra parte que pueda gestionar de manera más efectiva el riesgo particular dependiendo de la valoración de riesgos; implica la decisión de compartir ciertos riesgos con partes externas."]
[null,null,"ACEPTACIÓN O RETENCIÓN DEL RIESGO","Tomar la decisión de aceptar las consecuencias de un riesgo en particular, es decir, no se realiza ninguna acción respecto al riesgo "]

{"sheet":"Valoración de Activos","index":5,"n_rows":79,"n_cols":19,"rows_kept":79,"cut":false,"hidden":false,"merged":[[3,9,5,9],[1,1,1,14],[2,1,2,12],[3,11,3,14],[4,11,4,14],[3,10,5,10],[3,1,5,1],[3,4,5,4],[3,5,5,5],[3,6,5,6],[3,7,5,7],[3,8,5,8],[3,2,5,2],[3,3,5,3]]}
[]
[null,"Listado y valoración de los activos de información"]
[null," "]
[null,"Nro. Activo","Proceso Macro","Subproceso","Tipo de Activo ","Nombre de Activo","Descripción del activo ","Intención del Uso","Tipo de soporte","Propietario del Activo","Ubicación","Valoración de Impacto (pérdida)"]
[null,null,null,null,null,null,null,null,null,null,null,"C: Confidencialidad\nI: Integridad\nD: Disponibilidad"]
[null,null,null,null,null,null,null,null,null,null,null,"C","I","D","VA"]
[null,"A1","Proceso Macro 1","Subproceso 1","Software","e-Productos","Sistema para compras en línea","Compras en línea","Virtual en línea","Director de Compras","Amazon Cloud",3,3,2,{"$f":"(L7+M7+N7)/3","v":2.6666666666666665},null,null,"Tipo_Activo","Tipo_Soporte"]
[null,"A2",null,null,"Organización","Activo 2",null,null,null,null,null,3,3,2,{"$f":"(L8+M8+N8)/3","v":2.6666666666666665},null,null,"Organización","Físico"]
[null,"A3",null,null,"Software","Activo 3",null,null,null,null,null,3,3,2,2.6666666666666665,null,null,"Software","Virtual en línea"]
[null,"A4",null,null,"Hardware","Activo 4",null,null,null,null,null,3,3,2,2.6666666666666665,null,null,"Hardware","Acceso remoto"]
[null,"A5",null,null,"Red","Activo 5",null,null,null,null,null,3,3,2,2.6666666666666665,null,null,"Red","Telefónico"]
[null,"A6",null,null,"Personal","Activo 6",null,null,null,null,null,3,3,2,2.6666666666666665,null,null,"Personal","Físico y Virtual"]
[null,"A7",null,null,"Sitio","Activo 7",null,null,null,null,null,3,3,2,2.6666666666666665,null,null,"Sitio","Físico y Telefónico"]
[null,"A8",null,null,"Información","Activo 8",null,null,null,null,null,3,3,2,2.6666666666666665,null,null,"Información"]
[null,"A9",null,null,"Organización","Activo 9",null,null,null,null,null,3,3,2,2.6666666666666665]
[null,"A10",null,null,"Software","Activo 10",null,null,null,null,null,3,3,2,{"$f":"(L16+M16+N16)/3","v":2.6666666666666665}]
[null,"A11",null,null,"Hardware","Activo 11",null,null,null,null,null,3,3,2,2.6666666666666665]
[null,"A12",null,null,"Red","Activo 12",null,null,null,null,null,1,1,2,1.3333333333333333]
[null,"A13",null,null,"Personal","Activo 13",null,null,null,null,null,2,1,2,1.6666666666666667]
[null,"A14",null,null,"Sitio","Activo 14",null,null,null,null,null,2,1,2,1.6666666666666667]
{"$rows_left_out":60}
{"sheet":"Análisis de Riesgos","index":6,"n_rows":27,"n_cols":19,"rows_kept":27,"cut":false,"hidden":false,"merged":[[1,1,2,4],[1,5,1,10],[1,11,2,17],[1,18,3,18],[2,6,2,7],[2,8,3,8],[2,9,3,9],[2,10,3,10]]}
[]
[null,"Análisis de Riesgos",null,null,null,"Evaluación de Riesgos",null,null,null,null,null,"Tratamiento de Riesgos",null,null,null,null,null,null,"Riesgo residual"]
[null,null,null,null,null,"Impacto","Probabilidad",null,"controles implementados existentes","Cálculo de Evaluación Riesgo","Nivel de Riesgo"]
[null,"Nro. Activo","Nombre Activo","Amenaza","Vulnerabilidad","VA\n(CID)","Nivel de amenaza","Nivel de vulnerabilidad",null,null,null,"Método de tratamiento de Riesgos","Tipo de control","Controles a Implementar","Nivel de amenaza","Nivel de vulnerabilidad","Cálculo de Evaluación Riesgo con el  control implementado","Nivel de Riesgo con el control Implementado"]
[null,{"$f":"'Valoración de Activos'!B7","v":"A1"},{"$f":"'Valoración de Activos'!F7","v":"e-Productos"},"Saturación del sistema de información ","Servicios innecesarios habilitados",{"$f":"'Valoración de Activos'!O7","v":2.6666666666666665},3,2,"Ninguno",{"$f":"IF(F5*G5*H5=0,\" \",F5*G5*H5)","v":16},{"$f":"IFERROR(VLOOKUP(J5,'Evaluación de Riesgos'!$N$3:$P$5,3,TRUE),\"\")","v":"ALTO"},{"$f":"IFERROR(VLOOKUP(J5,'Opc. Tratamiento Riesgo'!$F$3:$H$4,3,TRUE),\"\")","v":"MODIFICAR / PREVENIR / COMPARTIR "},{"$f":"IF(AND(J5>=9,J5<=27),\"CONTROL CORRECTIVO\",IF(AND(J5>=4,J5<9),\"CONTROL PREVENTIVO\",IF(AND(J5>=1,J5<4),\"MONITOREO Y CONTROL\")))","v":"CONTROL CORRECTIVO"},"4.6 Gestión de la capacidad",1,1,{"$f":"IF($F$5*O5*P5=0,\" \",$F$5*O5*P5)","v":2.6666666666666665},{"$f":"IFERROR(VLOOKUP(Q5,'Evaluación de Riesgos'!$N$3:$P$5,3,TRUE),\"\")","v":"BAJO"},{"$f":"IF(Q5=\" \",\" \",IF(Q5<3,\"ACEPTABLE\",\"INACEPTABLE\"))","v":"ACEPTABLE"}]
[null,{"$f":"'Valoración de Activos'!B8","v":"A2"},{"$f":"'Valoración de Activos'!F8","v":"Activo 2"},null,null,{"$f":"'Valoración de Activos'!O8","v":2.6666666666666665},1,1,null,{"$f":"IF(F6*G6*H6=0,\" \",F6*G6*H6)","v":2.6666666666666665},{"$f":"IFERROR(VLOOKUP(J6,'Evaluación de Riesgos'!$N$3:$P$5,3,TRUE),\"\")","v":"BAJO"},{"$f":"IFERROR(VLOOKUP(J6,'Opc. Tratamiento Riesgo'!$F$3:$H$4,3,TRUE),\"\")","v":"RETENER / ACEPTAR"},"MONITOREO Y CONTROL",null,1,1,2.6666666666666665,{"$f":"IFERROR(VLOOKUP(Q6,'Evaluación de Riesgos'!$N$3:$P$5,3,TRUE),\"\")","v":"BAJO"},{"$f":"IF(Q6=\" \",\" \",IF(Q6<3,\"ACEPTABLE\",\"INACEPTABLE\"))","v":"ACEPTABLE"}]
[null,{"$f":"'Valoración de Activos'!B10","v":"A4"},{"$f":"'Valoración de Activos'!F10","v":"Activo 4"},null,null,{"$f":"'Valoración de Activos'!O9","v":2.6666666666666665},1,1,null,{"$f":"IF(F7*G7*H7=0,\" \",F7*G7*H7)","v":2.6666666666666665},{"$f":"IFERROR(VLOOKUP(J7,'Evaluación de Riesgos'!$N$3:$P$5,3,TRUE),\"\")","v":"BAJO"},{"$f":"IFERROR(VLOOKUP(J7,'Opc. Tratamiento Riesgo'!$F$3:$H$4,3,TRUE),\"\")","v":"RETENER / ACEPTAR"},{"$f":"IF(AND(J7>=9,J7<=27),\"CONTROL CORRECTIVO\",IF(AND(J7>=4,J7<9),\"CONTROL PREVENTIVO\",IF(AND(J7>=1,J7<4),\"MONITOREO Y CONTROL\")))","v":"MONITOREO Y CONTROL"},null,1,1,2.6666666666666665,{"$f":"IFERROR(VLOOKUP(Q7,'Evaluación de Riesgos'!$N$3:$P$5,3,TRUE),\"\")","v":"BAJO"},"ACEPTABLE"]
[null,{"$f":"'Valoración de Activos'!B11","v":"A5"},{"$f":"'Valoración de Activos'!F11","v":"Activo 5"},null,null,{"$f":"'Valoración de Activos'!O10","v":2.6666666666666665},3,1,null,{"$f":"IF(F8*G8*H8=0,\" \",F8*G8*H8)","v":8},{"$f":"IFERROR(VLOOKUP(J8,'Evaluación de Riesgos'!$N$3:$P$5,3,TRUE),\"\")","v":"MEDIO"},{"$f":"IFERROR(VLOOKUP(J8,'Opc. Tratamiento Riesgo'!$F$3:$H$4,3,TRUE),\"\")","v":"MODIFICAR / PREVENIR / COMPARTIR "},"CONTROL PREVENTIVO",null,1,1,2.6666666666666665,{"$f":"IFERROR(VLOOKUP(Q8,'Evaluación de Riesgos'!$N$3:$P$5,3,TRUE),\"\")","v":"BAJO"},"ACEPTABLE"]
[null,{"$f":"'Valoración de Activos'!B12","v":"A6"},{"$f":"'Valoración de Activos'!F12","v":"Activo 6"},null,null,{"$f":"'Valoración de Activos'!O11","v":2.6666666666666665},1,2,null,5.333333333333333,{"$f":"IFERROR(VLOOKUP(J9,'Evaluación de Riesgos'!$N$3:$P$5,3,TRUE),\"\")","v":"MEDIO"},{"$f":"IFERROR(VLOOKUP(J9,'Opc. Tratamiento Riesgo'!$F$3:$H$4,3,TRUE),\"\")","v":"MODIFICAR / PREVENIR / COMPARTIR "},"CONTROL PREVENTIVO",null,1,1,2.6666666666666665,{"$f":"IFERROR(VLOOKUP(Q9,'Evaluación de Riesgos'!$N$3:$P$5,3,TRUE),\"\")","v":"BAJO"},"ACEPTABLE"]
[null,{"$f":"'Valoración de Activos'!B13","v":"A7"},{"$f":"'Valoración de Activos'!F13","v":"Activo 7"},null,null,{"$f":"'Valoración de Activos'!O12","v":2.6666666666666665},2,2,null,10.666666666666666,{"$f":"IFERROR(VLOOKUP(J10,'Evaluación de Riesgos'!$N$3:$P$5,3,TRUE),\"\")","v":"ALTO"},{"$f":"IFERROR(VLOOKUP(J10,'Opc. Tratamiento Riesgo'!$F$3:$H$4,3,TRUE),\"\")","v":"MODIFICAR / PREVENIR / COMPARTIR "},"CONTROL CORRECTIVO",null,1,1,2.6666666666666665,{"$f":"IFERROR(VLOOKUP(Q10,'Evaluación de Riesgos'!$N$3:$P$5,3,TRUE),\"\")","v":"BAJO"},"ACEPTABLE"]
[null,{"$f":"'Valoración de Activos'!B14","v":"A8"},{"$f":"'Valoración de Activos'!F14","v":"Activo 8"},null,null,{"$f":"'Valoración de Activos'!O13","v":2.6666666666666665},1,2,null,5.333333333333333,{"$f":"IFERROR(VLOOKUP(J11,'Evaluación de Riesgos'!$N$3:$P$5,3,TRUE),\"\")","v":"MEDIO"},{"$f":"IFERROR(VLOOKUP(J11,'Opc. Tratamiento Riesgo'!$F$3:$H$4,3,TRUE),\"\")","v":"MODIFICAR / PREVENIR / COMPARTIR "},"CONTROL PREVENTIVO",null,1,2,5.333333333333333,{"$f":"IFERROR(VLOOKUP(Q11,'Evaluación de Riesgos'!$N$3:$P$5,3,TRUE),\"\")","v":"MEDIO"},"INACEPTABLE"]
[null,{"$f":"'Valoración de Activos'!B15","v":"A9"},{"$f":"'Valoración de Activos'!F15","v":"Activo 9"},null,null,{"$f":"'Valoración de Activos'!O14","v":2.6666666666666665},1,2,null,5.333333333333333,{"$f":"IFERROR(VLOOKUP(J12,'Evaluación de Riesgos'!$N$3:$P$5,3,TRUE),\"\")","v":"MEDIO"},{"$f":"IFERROR(VLOOKUP(J12,'Opc. Tratamiento Riesgo'!$F$3:$H$4,3,TRUE),\"\")","v":"MODIFICAR / PREVENIR / COMPARTIR "},"CONTROL PREVENTIVO",null,1,1,{"$f":"IF($F$5*O12*P12=0,\" \",$F$5*O12*P12)","v":2.6666666666666665},{"$f":"IFERROR(VLOOKUP(Q12,'Evaluación de Riesgos'!$N$3:$P$5,3,TRUE),\"\")","v":"BAJO"},"ACEPTABLE"]
[null,{"$f":"'Valoración de Activos'!B17","v":"A11"},{"$f":"'Valoración de Activos'!F16","v":"Activo 10"},null,null,{"$f":"'Valoración de Activos'!O15","v":2.6666666666666665},1,2,null,5.333333333333333,{"$f":"IFERROR(VLOOKUP(J13,'Evaluación de Riesgos'!$N$3:$P$5,3,TRUE),\"\")","v":"MEDIO"},{"$f":"IFERROR(VLOOKUP(J13,'Opc. Tratamiento Riesgo'!$F$3:$H$4,3,TRUE),\"\")","v":"MODIFICAR / PREVENIR / COMPARTIR "},"CONTROL PREVENTIVO",null,1,1,2.6666666666666665,{"$f":"IFERROR(VLOOKUP(Q13,'Evaluación de Riesgos'!$N$3:$P$5,3,TRUE),\"\")","v":"BAJO"},"ACEPTABLE"]
[null,{"$f":"'Valoración de Activos'!B18","v":"A12"},{"$f":"'Valoración de Activos'!F17","v":"Activo 11"},null,null,{"$f":"'Valoración de Activos'!O16","v":2.6666666666666665},1,2,null,5.333333333333333,{"$f":"IFERROR(VLOOKUP(J14,'Evaluación de Riesgos'!$N$3:$P$5,3,TRUE),\"\")","v":"MEDIO"},{"$f":"IFERROR(VLOOKUP(J14,'Opc. Tratamiento Riesgo'!$F$3:$H$4,3,TRUE),\"\")","v":"MODIFICAR / PREVENIR / COMPARTIR "},"CONTROL PREVENTIVO",null,1,1,2.6666666666666665,{"$f":"IFERROR(VLOOKUP(Q14,'Evaluación de Riesgos'!$N$3:$P$5,3,TRUE),\"\")","v":"BAJO"},"ACEPTABLE"]
[null,{"$f":"'Valoración de Activos'!B19","v":"A13"},{"$f":"'Valoración de Activos'!F18","v":"Activo 12"},null,null,{"$f":"'Valoración de Activos'!O17","v":2.6666666666666665},1,2,null,5.333333333333333,{"$f":"IFERROR(VLOOKUP(J15,'Evaluación de Riesgos'!$N$3:$P$5,3,TRUE),\"\")","v":"MEDIO"},{"$f":"IFERROR(VLOOKUP(J15,'Opc. Tratamiento Riesgo'!$F$3:$H$4,3,TRUE),\"\")","v":"MODIFICAR / PREVENIR / COMPARTIR "},"CONTROL PREVENTIVO",null,1,1,2.6666666666666665,{"$f":"IFERROR(VLOOKUP(Q15,'Evaluación de Riesgos'!$N$3:$P$5,3,TRUE),\"\")","v":"BAJO"},"ACEPTABLE"]
[null,{"$f":"'Valoración de Activos'!B20","v":"A14"},{"$f":"'Valoración de Activos'!F19","v":"Activo 13"},null,null,{"$f":"'Valoración de Activos'!O18","v":1.3333333333333333},1,2,null,2.6666666666666665,{"$f":"IFERROR(VLOOKUP(J16,'Evaluación de Riesgos'!$N$3:$P$5,3,TRUE),\"\")","v":"BAJO"},{"$f":"IFERROR(VLOOKUP(J16,'Opc. Tratamiento Riesgo'!$F$3:$H$4,3,TRUE),\"\")","v":"RETENER / ACEPTAR"},{"$f":"IF(AND(J16>=9,J16<=27),\"CONTROL CORRECTIVO\",IF(AND(J16>=4,J16<9),\"CONTROL PREVENTIVO\",IF(AND(J16>=1,J16<4),\"MONITOREO Y CONTROL\")))","v":"MONITOREO Y CONTROL"},null,1,1,{"$f":"IF($F$5*O16*P16=0,\" \",$F$5*O16*P16)","v":2.6666666666666665},{"$f":"IFERROR(VLOOKUP(Q16,'Evaluación de Riesgos'!$N$3:$P$5,3,TRUE),\"\")","v":"BAJO"},{"$f":"IF(Q16=\" \",\" \",IF(Q16<3,\"ACEPTABLE\",\"INACEPTABLE\"))","v":"ACEPTABLE"}]
[null,{"$f":"'Valoración de Activos'!B21","v":"A15"},{"$f":"'Valoración de Activos'!F20","v":"Activo 14"},null,null,{"$f":"'Valoración de Activos'!O19","v":1.6666666666666667},3,3,null,15,{"$f":"IFERROR(VLOOKUP(J17,'Evaluación de Riesgos'!$N$3:$P$5,3,TRUE),\"\")","v":"ALTO"},{"$f":"IFERROR(VLOOKUP(J17,'Opc. Tratamiento Riesgo'!$F$3:$H$4,3,TRUE),\"\")","v":"MODIFICAR / PREVENIR / COMPARTIR "},"CONTROL CORRECTIVO",null,1,2,5.333333333333333,{"$f":"IFERROR(VLOOKUP(Q17,'Evaluación de Riesgos'!$N$3:$P$5,3,TRUE),\"\")","v":"MEDIO"},"INACEPTABLE"]
[null,{"$f":"'Valoración de Activos'!B22","v":"A16"},{"$f":"'Valoración de Activos'!F21","v":"Activo 15"},null,null,{"$f":"'Valoración de Activos'!O20","v":1.6666666666666667},2,3,null,10,{"$f":"IFERROR(VLOOKUP(J18,'Evaluación de Riesgos'!$N$3:$P$5,3,TRUE),\"\")","v":"ALTO"},{"$f":"IFERROR(VLOOKUP(J18,'Opc. Tratamiento Riesgo'!$F$3:$H$4,3,TRUE),\"\")","v":"MODIFICAR / PREVENIR / COMPARTIR "},"CONTROL CORRECTIVO",null,1,1,2.6666666666666665,{"$f":"IFERROR(VLOOKUP(Q18,'Evaluación de Riesgos'!$N$3:$P$5,3,TRUE),\"\")","v":"BAJO"},"ACEPTABLE"]
[null,{"$f":"'Valoración de Activos'!B23","v":"A17"},{"$f":"'Valoración de Activos'!F22","v":"Activo 16"},null,null,{"$f":"'Valoración de Activos'!O21","v":1.6666666666666667},2,2,null,6.666666666666667,{"$f":"IFERROR(VLOOKUP(J19,'Evaluación de Riesgos'!$N$3:$P$5,3,TRUE),\"\")","v":"MEDIO"},{"$f":"IFERROR(VLOOKUP(J19,'Opc. Tratamiento Riesgo'!$F$3:$H$4,3,TRUE),\"\")","v":"MODIFICAR / PREVENIR / COMPARTIR "},"CONTROL PREVENTIVO",null,1,2,5.333333333333333,{"$f":"IFERROR(VLOOKUP(Q19,'Evaluación de Riesgos'!$N$3:$P$5,3,TRUE),\"\")","v":"MEDIO"},"INACEPTABLE"]
[null,{"$f":"'Valoración de Activos'!B24","v":"A18"},{"$f":"'Valoración de Activos'!F23","v":"Activo 17"},null,null,{"$f":"'Valoración de Activos'!O22","v":1.3333333333333333},2,3,null,8,{"$f":"IFERROR(VLOOKUP(J20,'Evaluación de Riesgos'!$N$3:$P$5,3,TRUE),\"\")","v":"MEDIO"},{"$f":"IFERROR(VLOOKUP(J20,'Opc. Tratamiento Riesgo'!$F$3:$H$4,3,TRUE),\"\")","v":"MODIFICAR / PREVENIR / COMPARTIR "},"CONTROL PREVENTIVO",null,1,1,2.6666666666666665,{"$f":"IFERROR(VLOOKUP(Q20,'Evaluación de Riesgos'!$N$3:$P$5,3,TRUE),\"\")","v":"BAJO"},"ACEPTABLE"]
{"$rows_left_out":8}
{"sheet":"Catálogo Amenazas","index":7,"n_rows":75,"n_cols":6,"rows_kept":75,"cut":false,"hidden":false,"merged":[[3,1,3,2],[1,1,1,2],[65,1,68,1],[2,1,2,3],[0,1,0,3],[71,1,74,1],[37,1,62,1],[6,1,11,1],[14,1,19,1],[22,1,29,1],[32,1,34,1]]}
[null,"                SUBSECRETARÍA DE GOBIERNO  \nELECTRÓNICO  Y REGISTRO CIVIL"]
[]
[null,"CATALOGO DE AMENAZAS TÍPICAS\nFuente: ISO/IEC 27005:2022"]
[]
[null,"CATEGORIA","AMENAZA","TIPO DE FUENTE DE RIESGO"]
[null,null,"Amenazas físicas"]
[null,"Amenazas físicas","Fuego","A, D,E",null,"D = deliberado"]
[null,null,"Agua","A, D, E",null,"A = accidental"]
[null,null,"Contaminación, radiaciones nocivas","A, D, E",null,"E = ambiental"]
[null,null,"Accidente grave","A, D, E"]
[null,null,"Explosión","A, D, E"]
[null,null,"Polvo, corrosión, congelación ","A, D, E"]
[]
[null,null,"Amenazas naturales"]
[null,"Amenazas naturales","Fenómeno climático","E"]
[null,null,"Fenómeno sísmico","E"]
[null,null,"Fenómeno volcánico","E"]
[null,null,"Fenómeno meteorológico","E"]
[null,null,"Inundación","E"]
[null,null,"Pandemia/fenómeno epidémico ","E"]
{"$rows_left_out":56}
{"sheet":"Catálogo Vulnerabilidades","index":8,"n_rows":98,"n_cols":3,"rows_kept":98,"cut":false,"hidden":false,"merged":[[70,1,97,1],[6,1,15,1],[18,1,39,1],[42,1,51,1],[54,1,61,1],[0,1,0,2],[1,1,1,2],[2,1,2,2],[3,1,3,2],[64,1,67,1]]}
[null,"                SUBSECRETARÍA DE GOBIERNO  \nELECTRÓNICO  Y REGISTRO CIVIL"]
[]
[null,"CATÁLOGO DE VULNERABILIDADES TÍPICAS\nFuente: ISO/IEC 27005:2022"]
[]
[null,"CATEGORIA","VULNERABILIDAD"]
[null,null,"Hardware"]
[null,"Hardware","Mantenimiento insuficiente/instalación defectuosa de los medios de almacenamiento"]
[null,null,"Susceptibilidad a la humedad, al polvo y a la suciedad"]
[null,null,"Esquemas de reemplazo periódico insuficientes de equipos"]
[null,null,"Sensibilidad a la radiación electromagnética"]
[null,null,"Control de cambios de configuración, insuficiente"]
[null,null,"Susceptibilidad a las variaciones de tensión"]
[null,null,"Susceptibilidad a las variaciones de temperatura"]
[null,null,"Almacenamiento sin protección"]
[null,null,"Falta de cuidado a disposición"]
[null,null,"Copia incontrolada"]
[]
[null,null,"Software"]
[null,"Software","Pruebas de software inexistentes o insuficientes"]
[null,null,"Defectos conocidos en el software"]
{"$rows_left_out":78}